Reaction Details
TargetFe(3+)-pyochelin receptor
LigandBDBM50444963
Substrate/Competitorn/a
Meas. Tech.ChEMBL_1281512 (CHEMBL3101970)
Ki 6.5±n/a nM
Citation Noël, SHoegy, FRivault, FRognan, DSchalk, IJMislin, GL Synthesis and biological properties of thiazole-analogues of pyochelin, a siderophore of Pseudomonas aeruginosa. Bioorg Med Chem Lett24:132-5 (2013) 
 
Fe(3+)-pyochelin receptor
Name:Fe(3+)-pyochelin receptor
Type:PROTEIN
Mol. Mass.:79988.52
Organism:Pseudomonas aeruginosa (strain ATCC 15692 / PAO1 / 1C / PRS 101 / LMG12228)
Description:ChEMBL_107982
Residue:720
BDBM50444963
NameBDBM50444963
Synonyms:CHEMBL3099907
TypeSmall organic molecule
Emp. Form.C14H14N2O4S2
Mol. Mass.338.402
SMILESCN1[C@@H](CSC1c1csc(n1)-c1ccc(O)cc1O)C(O)=O