Reaction Details
TargetSerine/threonine-protein kinase pim-2
LigandBDBM50445124
Substrate/Competitorn/a
Meas. Tech.ChEMBL_1284446 (CHEMBL3106174)
Ki 0.004000±n/a nM
Citation Burger, MTHan, WLan, JNishiguchi, GBellamacina, CLindval, MAtallah, GDing, YMathur, MMcBride, CBeans, ELMuller, KTamez, VZhang, YHuh, KFeucht, PZavorotinskaya, TDai, YHolash, JCastillo, JLangowski, JWang, YChen, MYGarcia, PD Structure Guided Optimization, in Vitro Activity, and in Vivo Activity of Pan-PIM Kinase Inhibitors. ACS Med Chem Lett4:1193-7 (2013) 
 
Serine/threonine-protein kinase pim-2
Name:Serine/threonine-protein kinase pim-2
Type:Serine/threonine-protein kinase
Mol. Mass.:34185.93
Organism:Homo sapiens (Human)
Description:Q9P1W9
Residue:311
BDBM50445124
NameBDBM50445124
Synonyms:CHEMBL3103868
TypeSmall organic molecule
Emp. Form.C22H22F2N6O
Mol. Mass.424.4465
SMILESN[C@H]1CCCN(C1)c1ccncc1NC(=O)c1nc(ccc1N)-c1c(F)cccc1F