Reaction Details
TargetSerine/threonine-protein kinase pim-2
LigandBDBM50445125
Substrate/Competitorn/a
Meas. Tech.ChEMBL_1284450 (CHEMBL3106178)
Ki 8.0±n/a nM
Citation Burger, MTHan, WLan, JNishiguchi, GBellamacina, CLindval, MAtallah, GDing, YMathur, MMcBride, CBeans, ELMuller, KTamez, VZhang, YHuh, KFeucht, PZavorotinskaya, TDai, YHolash, JCastillo, JLangowski, JWang, YChen, MYGarcia, PD Structure Guided Optimization, in Vitro Activity, and in Vivo Activity of Pan-PIM Kinase Inhibitors. ACS Med Chem Lett4:1193-7 (2013) 
 
Serine/threonine-protein kinase pim-2
Name:Serine/threonine-protein kinase pim-2
Type:Serine/threonine-protein kinase
Mol. Mass.:34185.93
Organism:Homo sapiens (Human)
Description:Q9P1W9
Residue:311
BDBM50445125
NameBDBM50445125
Synonyms:CHEMBL3103864
TypeSmall organic molecule
Emp. Form.C23H26N6O2
Mol. Mass.418.4915
SMILESCOc1ccccc1-c1ccc(N)c(n1)C(=O)Nc1cnccc1N1CCC[C@H](N)C1