Reaction Details
TargetSerine/threonine-protein kinase pim-3
LigandBDBM50445126
Substrate/Competitorn/a
Meas. Tech.ChEMBL_1284448 (CHEMBL3106176)
Ki 3.0±n/a nM
Citation Burger, MTHan, WLan, JNishiguchi, GBellamacina, CLindval, MAtallah, GDing, YMathur, MMcBride, CBeans, ELMuller, KTamez, VZhang, YHuh, KFeucht, PZavorotinskaya, TDai, YHolash, JCastillo, JLangowski, JWang, YChen, MYGarcia, PD Structure Guided Optimization, in Vitro Activity, and in Vivo Activity of Pan-PIM Kinase Inhibitors. ACS Med Chem Lett4:1193-7 (2013) 
 
Serine/threonine-protein kinase pim-3
Name:Serine/threonine-protein kinase pim-3
Type:Protein
Mol. Mass.:35888.19
Organism:Homo sapiens (Human)
Description:Q86V86
Residue:326
BDBM50445126
NameBDBM50445126
Synonyms:CHEMBL3103863
TypeSmall organic molecule
Emp. Form.C20H23N9O
Mol. Mass.405.4563
SMILESN[C@H]1CCCN(C1)c1ccncc1NC(=O)c1nc(ccc1N)-c1ccnc(N)n1