Reaction Details
TargetSerine/threonine-protein kinase pim-3
LigandBDBM50445127
Substrate/Competitorn/a
Meas. Tech.ChEMBL_1284448 (CHEMBL3106176)
Ki 5.0±n/a nM
Citation Burger, MTHan, WLan, JNishiguchi, GBellamacina, CLindval, MAtallah, GDing, YMathur, MMcBride, CBeans, ELMuller, KTamez, VZhang, YHuh, KFeucht, PZavorotinskaya, TDai, YHolash, JCastillo, JLangowski, JWang, YChen, MYGarcia, PD Structure Guided Optimization, in Vitro Activity, and in Vivo Activity of Pan-PIM Kinase Inhibitors. ACS Med Chem Lett4:1193-7 (2013) 
 
Serine/threonine-protein kinase pim-3
Name:Serine/threonine-protein kinase pim-3
Type:Protein
Mol. Mass.:35888.19
Organism:Homo sapiens (Human)
Description:Q86V86
Residue:326
BDBM50445127
NameBDBM50445127
Synonyms:CHEMBL3103862
TypeSmall organic molecule
Emp. Form.C21H23N7O
Mol. Mass.389.4536
SMILESN[C@H]1CCCN(C1)c1ccncc1NC(=O)c1nc(ccc1N)-c1ccncc1