Reaction Details
TargetSerine/threonine-protein kinase pim-3
LigandBDBM50445133
Substrate/Competitorn/a
Meas. Tech.ChEMBL_1284448 (CHEMBL3106176)
Ki 0.007000±n/a nM
Citation Burger, MTHan, WLan, JNishiguchi, GBellamacina, CLindval, MAtallah, GDing, YMathur, MMcBride, CBeans, ELMuller, KTamez, VZhang, YHuh, KFeucht, PZavorotinskaya, TDai, YHolash, JCastillo, JLangowski, JWang, YChen, MYGarcia, PD Structure Guided Optimization, in Vitro Activity, and in Vivo Activity of Pan-PIM Kinase Inhibitors. ACS Med Chem Lett4:1193-7 (2013) 
 
Serine/threonine-protein kinase pim-3
Name:Serine/threonine-protein kinase pim-3
Type:Protein
Mol. Mass.:35888.19
Organism:Homo sapiens (Human)
Description:Q86V86
Residue:326
BDBM50445133
NameBDBM50445133
Synonyms:CHEMBL3103869
TypeSmall organic molecule
Emp. Form.C22H22F2N6O2
Mol. Mass.440.4459
SMILESN[C@@H]1CN(CC[C@H]1O)c1ccncc1NC(=O)c1nc(ccc1N)-c1c(F)cccc1F