Reaction Details
TargetSerine/threonine-protein kinase pim-1
LigandBDBM50445140
Substrate/Competitorn/a
Meas. Tech.ChEMBL_1284449 (CHEMBL3106177)
Ki 30±n/a nM
Citation Burger, MTHan, WLan, JNishiguchi, GBellamacina, CLindval, MAtallah, GDing, YMathur, MMcBride, CBeans, ELMuller, KTamez, VZhang, YHuh, KFeucht, PZavorotinskaya, TDai, YHolash, JCastillo, JLangowski, JWang, YChen, MYGarcia, PD Structure Guided Optimization, in Vitro Activity, and in Vivo Activity of Pan-PIM Kinase Inhibitors. ACS Med Chem Lett4:1193-7 (2013) 
 
Serine/threonine-protein kinase pim-1
Name:Serine/threonine-protein kinase pim-1
Type:Protein
Mol. Mass.:35681.82
Organism:Homo sapiens (Human)
Description:P11309
Residue:313
BDBM50445140
NameBDBM50445140
Synonyms:CHEMBL3103876
TypeSmall organic molecule
Emp. Form.C15H18N6O
Mol. Mass.298.343
SMILESNc1nccnc1C(=O)Nc1cnccc1N1CCCCC1