Reaction Details
TargetP2Y purinoceptor 1
LigandBDBM50445197
Substrate/Competitorn/a
Meas. Tech.ChEMBL_1284787 (CHEMBL3107684)
Ki 94±n/a nM
Citation Qiao, JXWang, TCRuel, RThibeault, CL'Heureux, ASchumacher, WASpronk, SAHiebert, SBouthillier, GLloyd, JPi, ZSchnur, DMAbell, LMHua, JPrice, LALiu, EWu, QSteinbacher, TEBostwick, JSChang, MZheng, JGao, QMa, BMcDonnell, PAHuang, CSRehfuss, RWexler, RRLam, PY Conformationally constrained ortho-anilino diaryl ureas: discovery of 1-(2-(1'-neopentylspiro[indoline-3,4'-piperidine]-1-yl)phenyl)-3-(4-(trifluoromethoxy)phenyl)urea, a potent, selective, and bioavailable P2Y1 antagonist. J Med Chem56:9275-95 (2013) 
 
P2Y purinoceptor 1
Name:P2Y purinoceptor 1
Type:Enzyme
Mol. Mass.:42090.25
Organism:Homo sapiens (Human)
Description:P47900
Residue:373
BDBM50445197
NameBDBM50445197
Synonyms:CHEMBL3103633
TypeSmall organic molecule
Emp. Form.C23H21F3N4O2
Mol. Mass.442.4336
SMILESCN1CCN(c2ccccc2NC(=O)Nc2ccc(OC(F)(F)F)cc2)c2ccccc12