Reaction Details
TargetP2Y purinoceptor 1
LigandBDBM50445206
Substrate/Competitorn/a
Meas. Tech.ChEMBL_1284785 (CHEMBL3107682)
IC50 11±n/a nM
Citation Qiao, JXWang, TCRuel, RThibeault, CL'Heureux, ASchumacher, WASpronk, SAHiebert, SBouthillier, GLloyd, JPi, ZSchnur, DMAbell, LMHua, JPrice, LALiu, EWu, QSteinbacher, TEBostwick, JSChang, MZheng, JGao, QMa, BMcDonnell, PAHuang, CSRehfuss, RWexler, RRLam, PY Conformationally constrained ortho-anilino diaryl ureas: discovery of 1-(2-(1'-neopentylspiro[indoline-3,4'-piperidine]-1-yl)phenyl)-3-(4-(trifluoromethoxy)phenyl)urea, a potent, selective, and bioavailable P2Y1 antagonist. J Med Chem56:9275-95 (2013) 
 
P2Y purinoceptor 1
Name:P2Y purinoceptor 1
Type:Enzyme
Mol. Mass.:42090.25
Organism:Homo sapiens (Human)
Description:P47900
Residue:373
BDBM50445206
NameBDBM50445206
Synonyms:CHEMBL3105195
TypeSmall organic molecule
Emp. Form.C30H34F3N5O2
Mol. Mass.553.6185
SMILESCC(C)(C)CN1CCC2(CN(c3cnccc23)c2ccccc2NC(=O)Nc2ccc(OC(F)(F)F)cc2)CC1