Reaction Details
TargetLysine-specific histone demethylase 1A
LigandBDBM50346864
Substrate/Competitorn/a
Meas. Tech.ChEMBL_1285479 (CHEMBL3108411)
IC50 1300±n/a nM
Citation Sorna, VTheisen, ERStephens, BWarner, SLBearss, DJVankayalapati, HSharma, S High-throughput virtual screening identifies novel N'-(1-phenylethylidene)-benzohydrazides as potent, specific, and reversible LSD1 inhibitors. J Med Chem56:9496-508 (2014) 
 
Lysine-specific histone demethylase 1A
Name:Lysine-specific histone demethylase 1A
Type:Enzyme
Mol. Mass.:92901.01
Organism:Homo sapiens (Human)
Description:O60341
Residue:852
BDBM50346864
NameBDBM50346864
Synonyms:CHEMBL1797641 US8765820, 8
TypeSmall organic molecule
Emp. Form.C26H27N3O3
Mol. Mass.429.5109
SMILESNC1CC1c1ccc(NC(=O)C(Cc2ccccc2)NC(=O)OCc2ccccc2)cc1