Reaction Details
TargetA disintegrin and metalloproteinase with thrombospondin motifs 5
LigandBDBM50431947
Substrate/Competitorn/a
Meas. Tech.ChEMBL_1283991 (CHEMBL3107055)
IC50 230±n/a nM
Citation Sogame, SSuenaga, YAtobe, MKawanishi, MTanaka, EMiyoshi, S Discovery of a benzimidazole series of ADAMTS-5 (aggrecanase-2) inhibitors by scaffold hopping. Eur J Med Chem71:250-8 (2014) 
 
A disintegrin and metalloproteinase with thrombospondin motifs 5
Name:A disintegrin and metalloproteinase with thrombospondin motifs 5
Type:Enzyme
Mol. Mass.:101769.09
Organism:Homo sapiens (Human)
Description:Q9UNA0
Residue:930
BDBM50431947
NameBDBM50431947
Synonyms:CHEMBL2348091
TypeSmall organic molecule
Emp. Form.C15H13N3O3S2
Mol. Mass.347.412
SMILESOC(=O)CCc1sc(\C=C2/NC(=O)CS2)nc1-c1ccccn1