Reaction Details
TargetSeed linoleate 13S-lipoxygenase-1
LigandBDBM50312650
Substrate/Competitorn/a
Meas. Tech.ChEMBL_1284051 (CHEMBL3107208)
Ki 102600±n/a nM
Citation Ribeiro, DFreitas, MTomé, SMSilva, AMPorto, GCabrita, EJMarques, MMFernandes, E Inhibition of LOX by flavonoids: a structure-activity relationship study. Eur J Med Chem72:137-45 (2014) 
 
Seed linoleate 13S-lipoxygenase-1
Name:Seed linoleate 13S-lipoxygenase-1
Type:Enzyme
Mol. Mass.:94365.66
Organism:Glycine max (soybean)
Description:n/a
Residue:839
BDBM50312650
NameBDBM50312650
Synonyms:5,4'-dihydroxyflavone CHEMBL484662
TypeSmall organic molecule
Emp. Form.C15H10O4
Mol. Mass.254.2375
SMILESOc1ccc(cc1)-c1cc(O)c2c(cccc2=O)o1