Reaction Details
TargetSeed linoleate 13S-lipoxygenase-1
LigandBDBM7459
Substrate/Competitorn/a
Meas. Tech.ChEMBL_1284052 (CHEMBL3107209)
Ki 121700±n/a nM
Citation Ribeiro, DFreitas, MTomé, SMSilva, AMPorto, GCabrita, EJMarques, MMFernandes, E Inhibition of LOX by flavonoids: a structure-activity relationship study. Eur J Med Chem72:137-45 (2014) 
 
Seed linoleate 13S-lipoxygenase-1
Name:Seed linoleate 13S-lipoxygenase-1
Type:Enzyme
Mol. Mass.:94365.66
Organism:Glycine max (soybean)
Description:n/a
Residue:839
BDBM7459
NameBDBM7459
Synonyms:2-(3,4-dihydroxyphenyl)-5,7-dihydroxy-4H-chromen-4-one CHEMBL151 Luteolin (4) cid_5280445 med.21724, Compound 3
TypeSmall organic molecule
Emp. Form.C15H10O6
Mol. Mass.286.2363
SMILESOc1cc(O)c2c(c1)oc(cc2=O)-c1ccc(O)c(O)c1