Reaction Details
TargetPoly [ADP-ribose] polymerase 1
LigandBDBM50445854
Substrate/Competitorn/a
Meas. Tech.ChEMBL_1285751 (CHEMBL3107875)
IC50 50±n/a nM
Citation Giannini, GBattistuzzi, GVesci, LMilazzo, FMDe Paolis, FBarbarino, MGuglielmi, MBCarollo, VGallo, GArtali, RDallavalle, S Novel PARP-1 inhibitors based on a 2-propanoyl-3H-quinazolin-4-one scaffold. Bioorg Med Chem Lett24:462-6 (2014) 
 
Poly [ADP-ribose] polymerase 1
Name:Poly [ADP-ribose] polymerase 1
Type:n/a
Mol. Mass.:113114.22
Organism:Homo sapiens (Human)
Description:P09874
Residue:1014
BDBM50445854
NameBDBM50445854
Synonyms:CHEMBL3105410
TypeSmall organic molecule
Emp. Form.C20H21N5O3
Mol. Mass.379.4124
SMILESO=C(Cc1n[nH]c(=O)c2ccccc12)NCc1ccc(nc1)N1CCOCC1