Reaction Details
TargetPoly [ADP-ribose] polymerase 1
LigandBDBM50445824
Substrate/Competitorn/a
Meas. Tech.ChEMBL_1285751 (CHEMBL3107875)
IC50 56±n/a nM
Citation Giannini, GBattistuzzi, GVesci, LMilazzo, FMDe Paolis, FBarbarino, MGuglielmi, MBCarollo, VGallo, GArtali, RDallavalle, S Novel PARP-1 inhibitors based on a 2-propanoyl-3H-quinazolin-4-one scaffold. Bioorg Med Chem Lett24:462-6 (2014) 
 
Poly [ADP-ribose] polymerase 1
Name:Poly [ADP-ribose] polymerase 1
Type:n/a
Mol. Mass.:113114.22
Organism:Homo sapiens (Human)
Description:P09874
Residue:1014
BDBM50445824
NameBDBM50445824
Synonyms:CHEMBL3105405
TypeSmall organic molecule
Emp. Form.C22H21FN4O3
Mol. Mass.408.4255
SMILESFc1ccc(cc1)C(=O)N1CCN(CC1)C(=O)CCc1nc2ccccc2c(=O)[nH]1