Reaction Details
TargetGlutamate receptor ionotropic, NMDA 2B
LigandBDBM50445989
Substrate/Competitorn/a
Meas. Tech.ChEMBL_1283718 (CHEMBL3108298)
IC50 9.1±n/a nM
Citation Gitto, RDe Luca, LFerro, SRusso, EDe Sarro, GChisari, MCiranna, LAlvarez-Builla, JAlajarin, RBuemi, MRChimirri, A Synthesis, modelling and biological characterization of 3-substituted-1H-indoles as ligands of GluN2B-containing N-methyl-d-aspartate receptors. Bioorg Med Chem22:1040-8 (2014) 
 
Glutamate receptor ionotropic, NMDA 2B
Name:Glutamate receptor ionotropic, NMDA 2B
Type:Protein
Mol. Mass.:166077.66
Organism:Rattus norvegicus (Rat)
Description:Q00960
Residue:1482
BDBM50445989
NameBDBM50445989
Synonyms:CHEMBL3103126
TypeSmall organic molecule
Emp. Form.C22H23FN2O2
Mol. Mass.366.4286
SMILESOc1ccc2c(c[nH]c2c1)C(=O)CN1CCC(Cc2ccc(F)cc2)CC1