Reaction Details
TargetGlutamate receptor ionotropic, NMDA 2B
LigandBDBM50445990
Substrate/Competitorn/a
Meas. Tech.ChEMBL_1283718 (CHEMBL3108298)
IC50 9.4±n/a nM
Citation Gitto, RDe Luca, LFerro, SRusso, EDe Sarro, GChisari, MCiranna, LAlvarez-Builla, JAlajarin, RBuemi, MRChimirri, A Synthesis, modelling and biological characterization of 3-substituted-1H-indoles as ligands of GluN2B-containing N-methyl-d-aspartate receptors. Bioorg Med Chem22:1040-8 (2014) 
 
Glutamate receptor ionotropic, NMDA 2B
Name:Glutamate receptor ionotropic, NMDA 2B
Type:Protein
Mol. Mass.:166077.66
Organism:Rattus norvegicus (Rat)
Description:Q00960
Residue:1482
BDBM50445990
NameBDBM50445990
Synonyms:CHEMBL3103129
TypeSmall organic molecule
Emp. Form.C23H26FN3O3S
Mol. Mass.443.534
SMILESCS(=O)(=O)Nc1ccc2c(c[nH]c2c1)C(=O)CN1CCC(Cc2ccc(F)cc2)CC1