Reaction Details
TargetP2X purinoceptor 4
LigandBDBM50240669
Substrate/Competitorn/a
Meas. Tech.ChEMBL_1283892 (CHEMBL3106505)
IC50>20000±n/a nM
Citation Tian, MAbdelrahman, AWeinhausen, SHinz, SWeyer, SDosa, SEl-Tayeb, AMüller, CE Carbamazepine derivatives with P2X4 receptor-blocking activity. Bioorg Med Chem22:1077-88 (2014) 
 
P2X purinoceptor 4
Name:P2X purinoceptor 4
Type:Enzyme Catalytic Domain
Mol. Mass.:43374.70
Organism:Homo sapiens (Human)
Description:Purinergic, P2X4 0 HUMAN::Q99571
Residue:388
BDBM50240669
NameBDBM50240669
Synonyms:Acetic acid (S)-5-carbamoyl-10,11-dihydro-5H-dibenzo[b,f]azepin-10-yl ester ESLICARBAZEPINE
TypeSmall organic molecule
Emp. Form.C17H16N2O3
Mol. Mass.296.3205
SMILESCC(=O)O[C@H]1Cc2ccccc2N(C(N)=O)c2ccccc12