Reaction Details
TargetATP-dependent 6-phosphofructokinase
LigandBDBM50446114
Substrate/Competitorn/a
Meas. Tech.ChEMBL_1288119 (CHEMBL3110579)
IC50 14600±n/a nM
Citation Brimacombe, KRWalsh, MJLiu, LVásquez-Valdivieso, MGMorgan, HPMcNae, IFothergill-Gilmore, LAMichels, PAAuld, DSSimeonov, AWalkinshaw, MDShen, MBoxer, MB Identification of ML251, a Potent Inhibitor of T. brucei and T. cruzi Phosphofructokinase. ACS Med Chem Lett5:12-7 (2014) 
 
ATP-dependent 6-phosphofructokinase
Name:ATP-dependent 6-phosphofructokinase
Type:PROTEIN
Mol. Mass.:53581.09
Organism:Trypanosoma cruzi
Description:ChEMBL_108019
Residue:485
BDBM50446114
NameBDBM50446114
Synonyms:CHEMBL3108845
TypeSmall organic molecule
Emp. Form.C18H15Cl2N3O4S
Mol. Mass.440.3
SMILESCc1cc(NS(=O)(=O)c2ccc(NC(=O)Cc3ccc(Cl)cc3Cl)cc2)no1