Reaction Details
TargetATP-dependent 6-phosphofructokinase
LigandBDBM50446124
Substrate/Competitorn/a
Meas. Tech.ChEMBL_1288119 (CHEMBL3110579)
IC50 1300±n/a nM
Citation Brimacombe, KRWalsh, MJLiu, LVásquez-Valdivieso, MGMorgan, HPMcNae, IFothergill-Gilmore, LAMichels, PAAuld, DSSimeonov, AWalkinshaw, MDShen, MBoxer, MB Identification of ML251, a Potent Inhibitor of T. brucei and T. cruzi Phosphofructokinase. ACS Med Chem Lett5:12-7 (2014) 
 
ATP-dependent 6-phosphofructokinase
Name:ATP-dependent 6-phosphofructokinase
Type:PROTEIN
Mol. Mass.:53581.09
Organism:Trypanosoma cruzi
Description:ChEMBL_108019
Residue:485
BDBM50446124
NameBDBM50446124
Synonyms:CHEMBL3108835
TypeSmall organic molecule
Emp. Form.C19H17Cl2N3O4S
Mol. Mass.454.327
SMILESCN(C(=O)Cc1ccc(Cl)c(Cl)c1)c1ccc(cc1)S(=O)(=O)Nc1cc(C)on1