Reaction Details
TargetATP-dependent 6-phosphofructokinase
LigandBDBM50446088
Substrate/Competitorn/a
Meas. Tech.ChEMBL_1288121 (CHEMBL3110581)
IC50 15±n/a nM
Citation Brimacombe, KRWalsh, MJLiu, LVásquez-Valdivieso, MGMorgan, HPMcNae, IFothergill-Gilmore, LAMichels, PAAuld, DSSimeonov, AWalkinshaw, MDShen, MBoxer, MB Identification of ML251, a Potent Inhibitor of T. brucei and T. cruzi Phosphofructokinase. ACS Med Chem Lett5:12-7 (2014) 
 
ATP-dependent 6-phosphofructokinase
Name:ATP-dependent 6-phosphofructokinase
Type:PROTEIN
Mol. Mass.:53537.94
Organism:Trypanosoma brucei
Description:ChEMBL_1288121
Residue:487
BDBM50446088
NameBDBM50446088
Synonyms:CHEMBL3108870
TypeSmall organic molecule
Emp. Form.C16H12ClFN4O3S2
Mol. Mass.426.873
SMILESFc1ccc(CC(=O)Nc2ccc(cc2)S(=O)(=O)Nc2nncs2)cc1Cl