Reaction Details
TargetCalmodulin-domain protein kinase 1
LigandBDBM50446156
Substrate/Competitorn/a
Meas. Tech.ChEMBL_1287980 (CHEMBL3110679)
IC50 40±n/a nM
Citation Zhang, ZOjo, KKVidadala, RHuang, WGeiger, JAScheele, SChoi, RReid, MCKeyloun, KRRivas, KSiddaramaiah, LKComess, KMRobinson, KPMerta, PJKifle, LHol, WGParsons, MMerritt, EAMaly, DJVerlinde, CLVan Voorhis, WCFan, E Potent and selective inhibitors of CDPK1 from ACS Med Chem Lett5:40-44 (2014) 
 
Calmodulin-domain protein kinase 1
Name:Calmodulin-domain protein kinase 1
Type:Enzyme Catalytic Domain
Mol. Mass.:57248.42
Organism:Toxoplasma gondii
Description:n/a
Residue:507
BDBM50446156
NameBDBM50446156
Synonyms:CHEMBL3109001
TypeSmall organic molecule
Emp. Form.C15H19N7O
Mol. Mass.313.3577
SMILESCC(C)(C)n1nc(c(C(N)=O)c1N)-c1ccc2c(N)n[nH]c2c1