Reaction Details
TargetCalmodulin-domain protein kinase 1
LigandBDBM50446171
Substrate/Competitorn/a
Meas. Tech.ChEMBL_1287980 (CHEMBL3110679)
IC50 7.0±n/a nM
Citation Zhang, ZOjo, KKVidadala, RHuang, WGeiger, JAScheele, SChoi, RReid, MCKeyloun, KRRivas, KSiddaramaiah, LKComess, KMRobinson, KPMerta, PJKifle, LHol, WGParsons, MMerritt, EAMaly, DJVerlinde, CLVan Voorhis, WCFan, E Potent and selective inhibitors of CDPK1 from ACS Med Chem Lett5:40-44 (2014) 
 
Calmodulin-domain protein kinase 1
Name:Calmodulin-domain protein kinase 1
Type:Enzyme Catalytic Domain
Mol. Mass.:57248.42
Organism:Toxoplasma gondii
Description:n/a
Residue:507
BDBM50446171
NameBDBM50446171
Synonyms:CHEMBL3108999 US9956214, Compound 26
TypeSmall organic molecule
Emp. Form.C21H26N4O2
Mol. Mass.366.4567
SMILESCCCOc1ccc2cc(ccc2c1)-c1nn(c(N)c1C(N)=O)C(C)(C)C