Reaction Details
TargetReceptor-interacting serine/threonine-protein kinase 1
LigandBDBM50446264
Substrate/Competitorn/a
Meas. Tech.ChEMBL_1288030 (CHEMBL3110729)
IC50 6.0±n/a nM
Citation Harris, PABandyopadhyay, DBerger, SBCampobasso, NCapriotti, CACox, JADare, LFinger, JNHoffman, SJKahler, KMLehr, RLich, JDNagilla, RNolte, RTOuellette, MTPao, CSSchaeffer, MCSmallwood, ASun, HHSwift, BATotoritis, RDWard, PMarquis, RWBertin, JGough, PJ Discovery of Small Molecule RIP1 Kinase Inhibitors for the Treatment of Pathologies Associated with Necroptosis. ACS Med Chem Lett4:1238-43 (2013) 
 
Receptor-interacting serine/threonine-protein kinase 1
Name:Receptor-interacting serine/threonine-protein kinase 1
Type:Enzyme Catalytic Domain
Mol. Mass.:75926.99
Organism:Homo sapiens (Human)
Description:Q13546
Residue:671
BDBM50446264
NameBDBM50446264
Synonyms:CHEMBL3109214
TypeSmall organic molecule
Emp. Form.C24H16F4N6O
Mol. Mass.480.4171
SMILESFc1ccc(cc1NC(=O)Nc1cccc(c1)-c1c[nH]c2ncc(cc12)-c1cn[nH]c1)C(F)(F)F