Reaction Details
TargetClathrin heavy chain 1
LigandBDBM50446546
Substrate/Competitorn/a
Meas. Tech.ChEMBL_1286508 (CHEMBL3110376)
IC50 16000±n/a nM
Citation MacGregor, KARobertson, MJYoung, KAvon Kleist, LStahlschmidt, WWhiting, AChau, NRobinson, PJHaucke, VMcCluskey, A Development of 1,8-naphthalimides as clathrin inhibitors. J Med Chem57:131-43 (2014) 
 
Clathrin heavy chain 1
Name:Clathrin heavy chain 1
Type:PROTEIN
Mol. Mass.:191588.72
Organism:Homo sapiens (Human)
Description:ChEMBL_107994
Residue:1675
BDBM50446546
NameBDBM50446546
Synonyms:CHEMBL3110183
TypeSmall organic molecule
Emp. Form.C20H14NO6S
Mol. Mass.396.394
SMILESCOc1ccc(CN2C(=O)c3cccc4cc(cc(C2=O)c34)S([O-])(=O)=O)cc1