Reaction Details
TargetClathrin heavy chain 1
LigandBDBM50446548
Substrate/Competitorn/a
Meas. Tech.ChEMBL_1286508 (CHEMBL3110376)
IC50 6900±n/a nM
Citation MacGregor, KARobertson, MJYoung, KAvon Kleist, LStahlschmidt, WWhiting, AChau, NRobinson, PJHaucke, VMcCluskey, A Development of 1,8-naphthalimides as clathrin inhibitors. J Med Chem57:131-43 (2014) 
 
Clathrin heavy chain 1
Name:Clathrin heavy chain 1
Type:PROTEIN
Mol. Mass.:191588.72
Organism:Homo sapiens (Human)
Description:ChEMBL_107994
Residue:1675
BDBM50446548
NameBDBM50446548
Synonyms:CHEMBL3110181
TypeSmall organic molecule
Emp. Form.C19H12NO5S
Mol. Mass.366.368
SMILES[O-]S(=O)(=O)c1cc2C(=O)N(Cc3ccccc3)C(=O)c3cccc(c1)c23