Reaction Details
TargetClathrin heavy chain 1
LigandBDBM50446556
Substrate/Competitorn/a
Meas. Tech.ChEMBL_1286508 (CHEMBL3110376)
IC50 100000±n/a nM
Citation MacGregor, KARobertson, MJYoung, KAvon Kleist, LStahlschmidt, WWhiting, AChau, NRobinson, PJHaucke, VMcCluskey, A Development of 1,8-naphthalimides as clathrin inhibitors. J Med Chem57:131-43 (2014) 
 
Clathrin heavy chain 1
Name:Clathrin heavy chain 1
Type:PROTEIN
Mol. Mass.:191588.72
Organism:Homo sapiens (Human)
Description:ChEMBL_107994
Residue:1675
BDBM50446556
NameBDBM50446556
Synonyms:CHEMBL3110158
TypeSmall organic molecule
Emp. Form.C19H14N3O5S
Mol. Mass.396.397
SMILESNc1ccc(CN2C(=O)c3cccc4c(N)c(cc(C2=O)c34)S([O-])(=O)=O)cc1