Reaction Details
TargetTransient receptor potential cation channel subfamily M member 2
LigandBDBM50446560
Substrate/Competitorn/a
Meas. Tech.ChEMBL_1286614 (CHEMBL3111089)
IC50 51000±n/a nM
Citation Moreau, CKirchberger, TSwarbrick, JMBartlett, SJFliegert, RYorgan, TBauche, AHarneit, AGuse, AHPotter, BV Structure-activity relationship of adenosine 5'-diphosphoribose at the transient receptor potential melastatin 2 (TRPM2) channel: rational design of antagonists. J Med Chem56:10079-102 (2013) 
 
Transient receptor potential cation channel subfamily M member 2
Name:Transient receptor potential cation channel subfamily M member 2
Type:PROTEIN
Mol. Mass.:171218.39
Organism:Homo sapiens (Human)
Description:ChEMBL_103516
Residue:1503
BDBM50446560
NameBDBM50446560
Synonyms:CHEMBL3110214
TypeSmall organic molecule
Emp. Form.C19H25N5O14P2S
Mol. Mass.641.439
SMILESNc1ncnc2n([C@@H]3O[C@H](COP(O)(=O)OP(O)(=O)OC[C@H]4OC(O)[C@H](O)[C@@H]4O)[C@@H](O)[C@H]3O)c(nc12)-c1ccsc1