Reaction Details
TargetSerine/threonine-protein kinase pim-1
LigandBDBM50446564
Substrate/Competitorn/a
Meas. Tech.ChEMBL_1286357 (CHEMBL3111638)
IC50 20300±n/a nM
Citation Daletos, Gde Voogd, NJMüller, WEWray, VLin, WFeger, DKubbutat, MAly, AHProksch, P Cytotoxic and protein kinase inhibiting nakijiquinones and nakijiquinols from the sponge Dactylospongia metachromia. J Nat Prod77:218-26 (2014) 
 
Serine/threonine-protein kinase pim-1
Name:Serine/threonine-protein kinase pim-1
Type:Protein
Mol. Mass.:35681.82
Organism:Homo sapiens (Human)
Description:P11309
Residue:313
BDBM50446564
NameBDBM50446564
Synonyms:CHEMBL3109404
TypeSmall organic molecule
Emp. Form.C23H32O4
Mol. Mass.372.4978
SMILESCOC(=O)c1cc(O)c(O)c(C[C@]2(C)[C@@H](C)CC[C@]3(C)[C@H]2CCC=C3C)c1