Reaction Details
TargetSerine/threonine-protein kinase pim-1
LigandBDBM50446565
Substrate/Competitorn/a
Meas. Tech.ChEMBL_1286357 (CHEMBL3111638)
IC50>100000±n/a nM
Citation Daletos, Gde Voogd, NJMüller, WEWray, VLin, WFeger, DKubbutat, MAly, AHProksch, P Cytotoxic and protein kinase inhibiting nakijiquinones and nakijiquinols from the sponge Dactylospongia metachromia. J Nat Prod77:218-26 (2014) 
 
Serine/threonine-protein kinase pim-1
Name:Serine/threonine-protein kinase pim-1
Type:Protein
Mol. Mass.:35681.82
Organism:Homo sapiens (Human)
Description:P11309
Residue:313
BDBM50446565
NameBDBM50446565
Synonyms:CHEMBL3109402
TypeSmall organic molecule
Emp. Form.C24H33NO3
Mol. Mass.383.5237
SMILESCOc1cc2nc(C)oc2c(C[C@]2(C)[C@@H](C)CC[C@]3(C)[C@H]2CCC=C3C)c1O