Reaction Details
TargetSerine/threonine-protein kinase Nek2
LigandBDBM50446566
Substrate/Competitorn/a
Meas. Tech.ChEMBL_1286359 (CHEMBL3111640)
IC50 29900±n/a nM
Citation Daletos, Gde Voogd, NJMüller, WEWray, VLin, WFeger, DKubbutat, MAly, AHProksch, P Cytotoxic and protein kinase inhibiting nakijiquinones and nakijiquinols from the sponge Dactylospongia metachromia. J Nat Prod77:218-26 (2014) 
 
Serine/threonine-protein kinase Nek2
Name:Serine/threonine-protein kinase Nek2
Type:Enzyme
Mol. Mass.:51776.96
Organism:Homo sapiens (Human)
Description:P51955
Residue:445
BDBM50446566
NameBDBM50446566
Synonyms:CHEMBL3109401
TypeSmall organic molecule
Emp. Form.C26H39NO3
Mol. Mass.413.5928
SMILESCC(C)CC=Nc1cc(O)c(O)c(C[C@]2(C)[C@@H](C)CC[C@]3(C)[C@H]2CCC=C3C)c1O