Reaction Details
TargetInsulin-like growth factor 1 receptor
LigandBDBM50446566
Substrate/Competitorn/a
Meas. Tech.ChEMBL_1286362 (CHEMBL3111643)
IC50 1940±n/a nM
Citation Daletos, Gde Voogd, NJMüller, WEWray, VLin, WFeger, DKubbutat, MAly, AHProksch, P Cytotoxic and protein kinase inhibiting nakijiquinones and nakijiquinols from the sponge Dactylospongia metachromia. J Nat Prod77:218-26 (2014) 
 
Insulin-like growth factor 1 receptor
Name:Insulin-like growth factor 1 receptor
Type:Protein
Mol. Mass.:154776.79
Organism:Homo sapiens (Human)
Description:P08069
Residue:1367
BDBM50446566
NameBDBM50446566
Synonyms:CHEMBL3109401
TypeSmall organic molecule
Emp. Form.C26H39NO3
Mol. Mass.413.5928
SMILESCC(C)CC=Nc1cc(O)c(O)c(C[C@]2(C)[C@@H](C)CC[C@]3(C)[C@H]2CCC=C3C)c1O