Reaction Details
TargetRAC-alpha serine/threonine-protein kinase
LigandBDBM50446564
Substrate/Competitorn/a
Meas. Tech.ChEMBL_1286368 (CHEMBL3111649)
IC50 48400±n/a nM
Citation Daletos, Gde Voogd, NJMüller, WEWray, VLin, WFeger, DKubbutat, MAly, AHProksch, P Cytotoxic and protein kinase inhibiting nakijiquinones and nakijiquinols from the sponge Dactylospongia metachromia. J Nat Prod77:218-26 (2014) 
 
RAC-alpha serine/threonine-protein kinase
Name:RAC-alpha serine/threonine-protein kinase
Type:Enzyme
Mol. Mass.:55681.25
Organism:Homo sapiens (Human)
Description:P31749
Residue:480
BDBM50446564
NameBDBM50446564
Synonyms:CHEMBL3109404
TypeSmall organic molecule
Emp. Form.C23H32O4
Mol. Mass.372.4978
SMILESCOC(=O)c1cc(O)c(O)c(C[C@]2(C)[C@@H](C)CC[C@]3(C)[C@H]2CCC=C3C)c1