Reaction Details
TargetLIM domain kinase 1
LigandBDBM50446982
Substrate/Competitorn/a
Meas. Tech.ChEMBL_1291249 (CHEMBL3117034)
IC50 63±n/a nM
Citation Su, QIoannidis, SChuaqui, CAlmeida, LAlimzhanov, MBebernitz, GBell, KBlock, MHoward, THuang, SHuszar, DRead, JARivard Costa, CShi, JSu, MYe, MZinda, M Discovery of 1-methyl-1H-imidazole derivatives as potent Jak2 inhibitors. J Med Chem57:144-58 (2014) 
 
LIM domain kinase 1
Name:LIM domain kinase 1
Type:Enzyme Catalytic Domain
Mol. Mass.:72591.81
Organism:Homo sapiens (Human)
Description:gi_4505001
Residue:647
BDBM50446982
NameBDBM50446982
Synonyms:CHEMBL3116050
TypeSmall organic molecule
Emp. Form.C16H16FN9
Mol. Mass.353.3569
SMILESC[C@H](Nc1nc(Nc2cn(C)cn2)c2cc[nH]c2n1)c1ncc(F)cn1