Reaction Details
TargetHigh affinity nerve growth factor receptor
LigandBDBM50446982
Substrate/Competitorn/a
Meas. Tech.ChEMBL_1291431 (CHEMBL3118221)
IC50 35±n/a nM
Citation Su, QIoannidis, SChuaqui, CAlmeida, LAlimzhanov, MBebernitz, GBell, KBlock, MHoward, THuang, SHuszar, DRead, JARivard Costa, CShi, JSu, MYe, MZinda, M Discovery of 1-methyl-1H-imidazole derivatives as potent Jak2 inhibitors. J Med Chem57:144-58 (2014) 
 
High affinity nerve growth factor receptor
Name:High affinity nerve growth factor receptor
Type:n/a
Mol. Mass.:87498.18
Organism:Homo sapiens (Human)
Description:P04629
Residue:796
BDBM50446982
NameBDBM50446982
Synonyms:CHEMBL3116050
TypeSmall organic molecule
Emp. Form.C16H16FN9
Mol. Mass.353.3569
SMILESC[C@H](Nc1nc(Nc2cn(C)cn2)c2cc[nH]c2n1)c1ncc(F)cn1