Reaction Details
TargetTyrosine-protein kinase ABL1
LigandBDBM50446982
Substrate/Competitorn/a
Meas. Tech.ChEMBL_1291433 (CHEMBL3118223)
IC50 25±n/a nM
Citation Su, QIoannidis, SChuaqui, CAlmeida, LAlimzhanov, MBebernitz, GBell, KBlock, MHoward, THuang, SHuszar, DRead, JARivard Costa, CShi, JSu, MYe, MZinda, M Discovery of 1-methyl-1H-imidazole derivatives as potent Jak2 inhibitors. J Med Chem57:144-58 (2014) 
 
Tyrosine-protein kinase ABL1
Name:Tyrosine-protein kinase ABL1
Type:Enzyme
Mol. Mass.:122897.30
Organism:Homo sapiens (Human)
Description:P00519
Residue:1130
BDBM50446982
NameBDBM50446982
Synonyms:CHEMBL3116050
TypeSmall organic molecule
Emp. Form.C16H16FN9
Mol. Mass.353.3569
SMILESC[C@H](Nc1nc(Nc2cn(C)cn2)c2cc[nH]c2n1)c1ncc(F)cn1