Reaction Details
TargetTyrosine-protein kinase JAK3
LigandBDBM50446994
Substrate/Competitorn/a
Meas. Tech.ChEMBL_1291449 (CHEMBL3118239)
IC50>30000±n/a nM
Citation Su, QIoannidis, SChuaqui, CAlmeida, LAlimzhanov, MBebernitz, GBell, KBlock, MHoward, THuang, SHuszar, DRead, JARivard Costa, CShi, JSu, MYe, MZinda, M Discovery of 1-methyl-1H-imidazole derivatives as potent Jak2 inhibitors. J Med Chem57:144-58 (2014) 
 
Tyrosine-protein kinase JAK3
Name:Tyrosine-protein kinase JAK3
Type:Protein
Mol. Mass.:125111.08
Organism:Homo sapiens (Human)
Description:P52333
Residue:1124
BDBM50446994
NameBDBM50446994
Synonyms:CHEMBL3116059
TypeSmall organic molecule
Emp. Form.C19H19FN8O
Mol. Mass.394.4056
SMILESCOc1ccc2nc(NC(C)c3ncc(F)cn3)nc(Nc3cn(C)cn3)c2c1