Reaction Details
TargetPolyunsaturated fatty acid lipoxygenase ALOX15B
LigandBDBM50447176
Substrate/Competitorn/a
Meas. Tech.ChEMBL_1290549 (CHEMBL3119998)
IC50>100000±n/a nM
Citation Luci, DKJameson, JBYasgar, ADiaz, GJoshi, NKantz, AMarkham, KPerry, SKuhn, NYeung, JKerns, EHSchultz, LHolinstat, MNadler, JLTaylor-Fishwick, DAJadhav, ASimeonov, AHolman, TRMaloney, DJ Synthesis and structure-activity relationship studies of 4-((2-hydroxy-3-methoxybenzyl)amino)benzenesulfonamide derivatives as potent and selective inhibitors of 12-lipoxygenase. J Med Chem57:495-506 (2014) 
 
Polyunsaturated fatty acid lipoxygenase ALOX15B
Name:Polyunsaturated fatty acid lipoxygenase ALOX15B
Type:Protein
Mol. Mass.:75850.40
Organism:Homo sapiens (Human)
Description:n/a
Residue:676
BDBM50447176
NameBDBM50447176
Synonyms:CHEMBL3113166 | US10752581, Compound 36
TypeSmall organic molecule
Emp. Form.C21H19N3O5S
Mol. Mass.425.458
SMILESCOc1cccc(CNc2ccc(cc2)S(=O)(=O)Nc2nc3ccccc3o2)c1O