Reaction Details
TargetPolyunsaturated fatty acid lipoxygenase ALOX15B
LigandBDBM50447178
Substrate/Competitorn/a
Meas. Tech.ChEMBL_1290549 (CHEMBL3119998)
IC50>40000±n/a nM
Citation Luci, DKJameson, JBYasgar, ADiaz, GJoshi, NKantz, AMarkham, KPerry, SKuhn, NYeung, JKerns, EHSchultz, LHolinstat, MNadler, JLTaylor-Fishwick, DAJadhav, ASimeonov, AHolman, TRMaloney, DJ Synthesis and structure-activity relationship studies of 4-((2-hydroxy-3-methoxybenzyl)amino)benzenesulfonamide derivatives as potent and selective inhibitors of 12-lipoxygenase. J Med Chem57:495-506 (2014) 
 
Polyunsaturated fatty acid lipoxygenase ALOX15B
Name:Polyunsaturated fatty acid lipoxygenase ALOX15B
Type:Protein
Mol. Mass.:75850.40
Organism:Homo sapiens (Human)
Description:n/a
Residue:676
BDBM50447178
NameBDBM50447178
Synonyms:CHEMBL1596118 | US10752581, Compound 1
TypeSmall organic molecule
Emp. Form.C17H17N3O4S2
Mol. Mass.391.465
SMILESCOc1cccc(CNc2ccc(cc2)S(=O)(=O)Nc2nccs2)c1O