Reaction Details
TargetPolyunsaturated fatty acid lipoxygenase ALOX12
LigandBDBM50447175
Substrate/Competitorn/a
Meas. Tech.ChEMBL_1290553 (CHEMBL3116602)
IC50 340±n/a nM
Citation Luci, DKJameson, JBYasgar, ADiaz, GJoshi, NKantz, AMarkham, KPerry, SKuhn, NYeung, JKerns, EHSchultz, LHolinstat, MNadler, JLTaylor-Fishwick, DAJadhav, ASimeonov, AHolman, TRMaloney, DJ Synthesis and structure-activity relationship studies of 4-((2-hydroxy-3-methoxybenzyl)amino)benzenesulfonamide derivatives as potent and selective inhibitors of 12-lipoxygenase. J Med Chem57:495-506 (2014) 
 
Polyunsaturated fatty acid lipoxygenase ALOX12
Name:Polyunsaturated fatty acid lipoxygenase ALOX12
Type:Protein
Mol. Mass.:75689.18
Organism:Homo sapiens (Human)
Description:P18054
Residue:663
BDBM50447175
NameBDBM50447175
Synonyms:CHEMBL3113165 | US10752581, Compound 35
TypeSmall organic molecule
Emp. Form.C21H19N3O4S2
Mol. Mass.441.523
SMILESCOc1cccc(CNc2ccc(cc2)S(=O)(=O)Nc2nc3ccccc3s2)c1O