Reaction Details
TargetDNA gyrase subunit B
LigandBDBM50447299
Substrate/Competitorn/a
Meas. Tech.ChEMBL_1291282 (CHEMBL3117272)
IC50 2.5±n/a nM
Citation Kale, RRKale, MGWaterson, DRaichurkar, AHameed, SPManjunatha, MRKishore Reddy, BKMalolanarasimhan, KShinde, VKoushik, KJena, LKMenasinakai, SHumnabadkar, VMadhavapeddi, PBasavarajappa, HSharma, SNandishaiah, RMahesh Kumar, KNGanguly, SAhuja, VGaonkar, SNaveen Kumar, CNOgg, DBoriack-Sjodin, PASambandamurthy, VKde Sousa, SMGhorpade, SR Thiazolopyridone ureas as DNA gyrase B inhibitors: optimization of antitubercular activity and efficacy. Bioorg Med Chem Lett24:870-9 (2014) 
 
DNA gyrase subunit B
Name:DNA gyrase subunit B
Type:PROTEIN
Mol. Mass.:74505.25
Organism:Mycobacterium smegmatis
Description:ChEMBL_107961
Residue:675
BDBM50447299
NameBDBM50447299
Synonyms:CHEMBL3114208
TypeSmall organic molecule
Emp. Form.C21H27N5O4S
Mol. Mass.445.535
SMILESCCNC(=O)Nc1nc2cc(-c3cc(C)n(CCOC)c(=O)c3)c(=O)n(C(C)C)c2s1