Reaction Details
TargetDNA gyrase subunit B
LigandBDBM50447313
Substrate/Competitorn/a
Meas. Tech.ChEMBL_1291282 (CHEMBL3117272)
IC50 40±n/a nM
Citation Kale, RRKale, MGWaterson, DRaichurkar, AHameed, SPManjunatha, MRKishore Reddy, BKMalolanarasimhan, KShinde, VKoushik, KJena, LKMenasinakai, SHumnabadkar, VMadhavapeddi, PBasavarajappa, HSharma, SNandishaiah, RMahesh Kumar, KNGanguly, SAhuja, VGaonkar, SNaveen Kumar, CNOgg, DBoriack-Sjodin, PASambandamurthy, VKde Sousa, SMGhorpade, SR Thiazolopyridone ureas as DNA gyrase B inhibitors: optimization of antitubercular activity and efficacy. Bioorg Med Chem Lett24:870-9 (2014) 
 
DNA gyrase subunit B
Name:DNA gyrase subunit B
Type:PROTEIN
Mol. Mass.:74505.25
Organism:Mycobacterium smegmatis
Description:ChEMBL_107961
Residue:675
BDBM50447313
NameBDBM50447313
Synonyms:CHEMBL3114221
TypeSmall organic molecule
Emp. Form.C19H23N5O2S
Mol. Mass.385.483
SMILESCCNC(=O)Nc1nc2cc(-c3cccnc3)c(=O)n(CCC(C)C)c2s1