Reaction Details
TargetCalcitonin gene-related peptide type 1 receptor
LigandBDBM50184069
Substrate/Competitorn/a
Meas. Tech.ChEMBL_1291534 (CHEMBL3118706)
IC50 4.0±n/a nM
Citation Joshi, PAnderson, CBinch, HHadida, SYoo, SBergeron, DDecker, CterHaar, EMoore, JGarcia-Guzman, MTermin, A Identification of potent CNS-penetrant thiazolidinones as novel CGRP receptor antagonists. Bioorg Med Chem Lett24:845-9 (2014) 
 
Calcitonin gene-related peptide type 1 receptor
Name:Calcitonin gene-related peptide type 1 receptor
Type:Enzyme Catalytic Domain
Mol. Mass.:52980.45
Organism:Homo sapiens (Human)
Description:Q16602
Residue:461
BDBM50184069
NameBDBM50184069
Synonyms:CHEMBL207197 N-{(1S)-5-amino-1-[(4-pyridin-4-ylpiperazin-1-yl)carbonyl]pentyl}-3,5-dibromo-Nalpha-{[4-(2-oxo-1,4-dihydroquinazolin-3(2H)-yl)piperidin-1-yl]carbonyl}-D-tyrosinamide | OLCEGEPANT
TypeSmall organic molecule
Emp. Form.C38H47Br2N9O5
Mol. Mass.869.645
SMILESNCCCC[C@H](NC(=O)[C@@H](Cc1cc(Br)c(O)c(Br)c1)NC(=O)N1CCC(CC1)N1Cc2ccccc2NC1=O)C(=O)N1CCN(CC1)c1ccncc1