Reaction Details
TargetCalcitonin gene-related peptide type 1 receptor
LigandBDBM50447324
Substrate/Competitorn/a
Meas. Tech.ChEMBL_1291533 (CHEMBL3118705)
Ki 1.000000±n/a nM
Citation Joshi, PAnderson, CBinch, HHadida, SYoo, SBergeron, DDecker, CterHaar, EMoore, JGarcia-Guzman, MTermin, A Identification of potent CNS-penetrant thiazolidinones as novel CGRP receptor antagonists. Bioorg Med Chem Lett24:845-9 (2014) 
 
Calcitonin gene-related peptide type 1 receptor
Name:Calcitonin gene-related peptide type 1 receptor
Type:Enzyme Catalytic Domain
Mol. Mass.:52980.45
Organism:Homo sapiens (Human)
Description:Q16602
Residue:461
BDBM50447324
NameBDBM50447324
Synonyms:CHEMBL3114677
TypeSmall organic molecule
Emp. Form.C39H55FN6O3S
Mol. Mass.706.956
SMILESCC(C)(C)CCN1[C@@H](S[C@@H](CC(=O)N2CCC(CC2)N2CCc3ccccc3NC2=O)C1=O)c1cccc(F)c1N1CCN(CC1)C(C)(C)C