Reaction Details
TargetCalcitonin gene-related peptide type 1 receptor
LigandBDBM50447328
Substrate/Competitorn/a
Meas. Tech.ChEMBL_1291534 (CHEMBL3118706)
IC50 2.0±n/a nM
Citation Joshi, PAnderson, CBinch, HHadida, SYoo, SBergeron, DDecker, CterHaar, EMoore, JGarcia-Guzman, MTermin, A Identification of potent CNS-penetrant thiazolidinones as novel CGRP receptor antagonists. Bioorg Med Chem Lett24:845-9 (2014) 
 
Calcitonin gene-related peptide type 1 receptor
Name:Calcitonin gene-related peptide type 1 receptor
Type:Enzyme Catalytic Domain
Mol. Mass.:52980.45
Organism:Homo sapiens (Human)
Description:Q16602
Residue:461
BDBM50447328
NameBDBM50447328
Synonyms:CHEMBL3114494
TypeSmall organic molecule
Emp. Form.C37H51FN6O3S
Mol. Mass.678.903
SMILESCCN1CCN(CC1)c1c(F)cccc1C1SC(CC(=O)N2CCC(CC2)N2CCc3ccccc3NC2=O)C(=O)N1CCC(C)(C)C