Reaction Details
TargetCalcitonin gene-related peptide type 1 receptor
LigandBDBM50447338
Substrate/Competitorn/a
Meas. Tech.ChEMBL_1291533 (CHEMBL3118705)
Ki 8.0±n/a nM
Citation Joshi, PAnderson, CBinch, HHadida, SYoo, SBergeron, DDecker, CterHaar, EMoore, JGarcia-Guzman, MTermin, A Identification of potent CNS-penetrant thiazolidinones as novel CGRP receptor antagonists. Bioorg Med Chem Lett24:845-9 (2014) 
 
Calcitonin gene-related peptide type 1 receptor
Name:Calcitonin gene-related peptide type 1 receptor
Type:Enzyme Catalytic Domain
Mol. Mass.:52980.45
Organism:Homo sapiens (Human)
Description:Q16602
Residue:461
BDBM50447338
NameBDBM50447338
Synonyms:CHEMBL3114483
TypeSmall organic molecule
Emp. Form.C36H50N6O4S
Mol. Mass.662.885
SMILESCC(C)(C)CCN1C(SC(CC(=O)N2CCC(CC2)N2Cc3ccccc3NC2=O)C1=O)c1ccccc1N1CCN(CCO)CC1