Reaction Details
TargetCalcitonin gene-related peptide type 1 receptor
LigandBDBM50447356
Substrate/Competitorn/a
Meas. Tech.ChEMBL_1291533 (CHEMBL3118705)
Ki 9.0±n/a nM
Citation Joshi, PAnderson, CBinch, HHadida, SYoo, SBergeron, DDecker, CterHaar, EMoore, JGarcia-Guzman, MTermin, A Identification of potent CNS-penetrant thiazolidinones as novel CGRP receptor antagonists. Bioorg Med Chem Lett24:845-9 (2014) 
 
Calcitonin gene-related peptide type 1 receptor
Name:Calcitonin gene-related peptide type 1 receptor
Type:Enzyme Catalytic Domain
Mol. Mass.:52980.45
Organism:Homo sapiens (Human)
Description:Q16602
Residue:461
BDBM50447356
NameBDBM50447356
Synonyms:CHEMBL3114465
TypeSmall organic molecule
Emp. Form.C29H36N4O3S
Mol. Mass.520.686
SMILESCC(C)(C)CN1C(SC(CC(=O)N2CCC(CC2)N2Cc3ccccc3NC2=O)C1=O)c1ccccc1