Reaction Details
TargetCyclin-dependent kinase 4/G1/S-specific cyclin-D1
LigandBDBM50447512
Substrate/Competitorn/a
Meas. Tech.ChEMBL_1289041 (CHEMBL3118105)
IC50 3.8±n/a nM
Citation Reddy, MVAkula, BCosenza, SCAthuluridivakar, SMallireddigari, MRPallela, VRBilla, VKSubbaiah, DRBharathi, EVVasquez-Del Carpio, RPadgaonkar, ABaker, SJReddy, EP Discovery of 8-cyclopentyl-2-[4-(4-methyl-piperazin-1-yl)-phenylamino]-7-oxo-7,8-dihydro-pyrido[2,3-d]pyrimidine-6-carbonitrile (7x) as a potent inhibitor of cyclin-dependent kinase 4 (CDK4) and AMPK-related kinase 5 (ARK5). J Med Chem57:578-99 (2014) 
 
Cyclin-dependent kinase 4/G1/S-specific cyclin-D1
Name:Cyclin-dependent kinase 4/G1/S-specific cyclin-D1
Type:Protein Complex
Mol. Mass.:n/a
Description:CDK4/D1 complexes were purified from insect cells co-infected with baculovirus vectors containing each of the components.
Components:This complex has 2 components.
Component 1
Name:Cyclin-dependent kinase 4
Synonyms:CDK4 Cell division protein kinase 4 PSK-J3
Type:Enzyme Subunit
Mol. Mass.:33731.96
Organism:Homo sapiens (Human)
Description:P11802
Residue:303
Component 2
Name:G1/S-specific cyclin-D1
Synonyms:B-cell lymphoma 1 protein BCL-1 oncogene CCND1 PRAD1 | PRAD1 oncogene
Type:Enzyme Subunit
Mol. Mass.:33717.70
Organism:Homo sapiens (Human)
Description:n/a
Residue:295
BDBM50447512
NameBDBM50447512
Synonyms:CHEMBL3115681
TypeSmall organic molecule
Emp. Form.C24H27N7O
Mol. Mass.429.5175
SMILESCN1CCN(CC1)c1ccc(Nc2ncc3cc(C#N)c(=O)n(C4CCCC4)c3n2)cc1