Reaction Details
TargetProtein-arginine deiminase type-2
LigandBDBM50447757
Substrate/Competitorn/a
Meas. Tech.ChEMBL_1290370 (CHEMBL3119085)
Ki 8080±n/a nM
Citation Dreyton, CJAnderson, EDSubramanian, VBoger, DLThompson, PR Insights into the mechanism of streptonigrin-induced protein arginine deiminase inactivation. Bioorg Med Chem22:1362-9 (2014) 
 
Protein-arginine deiminase type-2
Name:Protein-arginine deiminase type-2
Type:PROTEIN
Mol. Mass.:75552.49
Organism:Homo sapiens (Human)
Description:ChEMBL_1290379
Residue:665
BDBM50447757
NameBDBM50447757
Synonyms:CHEMBL57818
TypeSmall organic molecule
Emp. Form.C14H9N3O2
Mol. Mass.251.2402
SMILESNC1=CC(=O)c2ccc(nc2C1=O)-c1ccccn1