Reaction Details
TargetProtein-arginine deiminase type-4
LigandBDBM50447761
Substrate/Competitorn/a
Meas. Tech.ChEMBL_1290377 (CHEMBL3119092)
IC50 1000±n/a nM
Citation Dreyton, CJAnderson, EDSubramanian, VBoger, DLThompson, PR Insights into the mechanism of streptonigrin-induced protein arginine deiminase inactivation. Bioorg Med Chem22:1362-9 (2014) 
 
Protein-arginine deiminase type-4
Name:Protein-arginine deiminase type-4
Type:Enzyme Catalytic Domain
Mol. Mass.:74078.90
Organism:Homo sapiens (Human)
Description:gi_216548487
Residue:663
BDBM50447761
NameBDBM50447761
Synonyms:CHEMBL60908
TypeSmall organic molecule
Emp. Form.C9H6N2O2
Mol. Mass.174.1561
SMILESNC1=CC(=O)c2cccnc2C1=O